Tutorial

java error 1722

Posted by on July 18
  • Error 1722. There is a problem with this Windows Installer package

    Error 1722. There is a problem with this Windows Installer package

  • How To Fix Java Runtime Environment Error 1722

    How To Fix Java Runtime Environment Error 1722

  • Install error 1722 - reinstalling Java did not work | Jitterbit Data

    Install error 1722 - reinstalling Java did not work | Jitterbit Data

  • Oracle Applications - Knowledge Sharing: Oracle: J2SE Runtime

    Oracle Applications - Knowledge Sharing: Oracle: J2SE Runtime

  • vCenter 6.7 Installation | Error 1722. There is a problem with this

    vCenter 6.7 Installation | Error 1722. There is a problem with this

  • Error 1722. There is a problem with this Windows Installer package

    Error 1722. There is a problem with this Windows Installer package

  • Error 1722. There is a problem with this Windows Installer package

    Error 1722. There is a problem with this Windows Installer package

  • DeployHappiness | Preventing java error 1722

    DeployHappiness | Preventing java error 1722

  • Error 1722 :: Custom actions|ERROR 1722 - EROS GREEK MYTHOLOGY ITV

    Error 1722 :: Custom actions|ERROR 1722 - EROS GREEK MYTHOLOGY ITV

  • 4730 proBook s: error in security for the 1722 HP Client Manager

    4730 proBook s: error in security for the 1722 HP Client Manager

  • Error 1722 Problem With Windows Installer Package

    Error 1722 Problem With Windows Installer Package

  • Solved: Re: error 1722 - HP Support Community - 6148578

    Solved: Re: error 1722 - HP Support Community - 6148578

  • Windows installer fatal error

    Windows installer fatal error

  • Solved: Re: error 1722 - HP Support Community - 6148578

    Solved: Re: error 1722 - HP Support Community - 6148578

  • HOW TO FIX - ERROR 1723 - YouTube

    HOW TO FIX - ERROR 1723 - YouTube

  • Solved: Re: error 1722 - HP Support Community - 6148578

    Solved: Re: error 1722 - HP Support Community - 6148578

  • How can i install pinnacle studio - Techyv.com

    How can i install pinnacle studio - Techyv.com

  • Error 1722: There is a problem with this Windows Installer package

    Error 1722: There is a problem with this Windows Installer package

  • Problem with Java 1.8 update 31 deployment

    Problem with Java 1.8 update 31 deployment

  • Java Runtime Environment 오류 1722 수정하는 방법

    Java Runtime Environment 오류 1722 수정하는 방법

Other Files

Copyright © 2019 - softwarespirit.com
Sitemap Index :